You are not logged in.

Read the FAQ and Knowledge Base before posting.
WiFi not emulated and not supported!!
We won't make a 3DS/2DS emulator.

#1 Re: Support II (decommissioned) » Why Pokemon Pearl and Diamond wont work? » 2007-06-11 18:59:39

You do not need no the why or the when just that the game does not work at the moment

If you want to play Pokemon Pearl or Diamond use no$gba but I must warn you it isa very slow on that emu.

#2 Re: Support II (decommissioned) » why? » 2007-06-09 12:17:46

There was no need to post two topics about the same problem.
The answer to your question is that the emu is not yet complete note the version 0.7.0 not even version 1.0.0 yet so some games will be slow and others will not work at all.

Ps. Have you changed frame skip to 0 if not change it you will find the option under the config menu.

#3 Re: Support » Building DemuME problem » 2007-06-07 14:29:53

Thanks rebuilt it and now it works.

#4 Re: Support » Building DemuME problem » 2007-06-07 12:46:14

I done as you said and now I only have two errors

obj/disView.o(.text+0x2325):disView.c: undefined reference to `armcpu_irqExeption'
obj/disView.o(.text+0x2348):disView.c: undefined reference to `armcpu_irqExeption'

looks like i am going in the right direction

#5 Re: Support » Building DemuME problem » 2007-06-07 12:00:27

I have added the files and pointed the linker to ws2_32.lib but now I get these errors

Compiler: Default compiler
Building Makefile: "C:\Documents and Settings\Alex\My Documents\DS Emu complier files\src\windows\Makefile.win"
Executing  make...
make.exe -f "C:\Documents and Settings\Alex\My Documents\DS Emu complier files\src\windows\Makefile.win" all
gcc.exe -c ../gdbstub/gdbstub.c -o obj/gdbstub.o -I"C:/Dev-Cpp/include"  -DVERSION=\"0.7.0\"  HAVE_LIBZZIP HAVE_LIBZ    -fexpensive-optimizations -O3 -march=pentium4 -msse2

../gdbstub/gdbstub.c:29:20: armcpu.h: No such file or directory
../gdbstub/gdbstub.c:35:21: gdbstub.h: No such file or directory
In file included from ../gdbstub/gdbstub.c:36:
../gdbstub/gdbstub_internal.h:41: error: syntax error before "u32"
../gdbstub/gdbstub_internal.h:41: warning: no semicolon at end of struct or union
../gdbstub/gdbstub_internal.h:44: warning: data definition has no type or storage class
../gdbstub/gdbstub_internal.h:57: error: syntax error before "u8"
../gdbstub/gdbstub_internal.h:57: warning: no semicolon at end of struct or union
../gdbstub/gdbstub_internal.h:59: warning: data definition has no type or storage class
../gdbstub/gdbstub_internal.h:61: error: syntax error before "buffer"
../gdbstub/gdbstub_internal.h:61: warning: data definition has no type or storage class
../gdbstub/gdbstub_internal.h:62: error: syntax error before '}' token
../gdbstub/gdbstub_internal.h:84: error: field `cpu_memio' has incomplete type
../gdbstub/gdbstub_internal.h:107: error: syntax error before "u32"
../gdbstub/gdbstub_internal.h:107: warning: no semicolon at end of struct or union
../gdbstub/gdbstub_internal.h:127: error: syntax error before "port_num"
../gdbstub/gdbstub_internal.h:127: warning: data definition has no type or storage class
../gdbstub/gdbstub_internal.h:137: error: syntax error before "stop_address"
../gdbstub/gdbstub_internal.h:137: warning: data definition has no type or storage class
../gdbstub/gdbstub_internal.h:150: error: syntax error before '}' token
../gdbstub/gdbstub.c: In function `causeQuit_gdb':
../gdbstub/gdbstub.c:143: error: `u8' undeclared (first use in this function)
../gdbstub/gdbstub.c:143: error: (Each undeclared identifier is reported only once
../gdbstub/gdbstub.c:143: error: for each function it appears in.)
../gdbstub/gdbstub.c:143: error: syntax error before "command"
../gdbstub/gdbstub.c:146: error: dereferencing pointer to incomplete type
../gdbstub/gdbstub.c:146: error: `command' undeclared (first use in this function)
../gdbstub/gdbstub.c: In function `indicateCPUStop_gdb':
../gdbstub/gdbstub.c:154: error: `u8' undeclared (first use in this function)
../gdbstub/gdbstub.c:154: error: syntax error before "command"
../gdbstub/gdbstub.c:157: error: dereferencing pointer to incomplete type
../gdbstub/gdbstub.c:157: error: `command' undeclared (first use in this function)
../gdbstub/gdbstub.c: At top level:
../gdbstub/gdbstub.c:172: error: syntax error before "u32"
../gdbstub/gdbstub.c:183: warning: parameter names (without types) in function declaration
../gdbstub/gdbstub.c:183: error: conflicting types for 'indicateCPUStop_gdb'
../gdbstub/gdbstub.c:153: error: previous definition of 'indicateCPUStop_gdb' was here
../gdbstub/gdbstub.c:183: warning: data definition has no type or storage class
../gdbstub/gdbstub.c:184: error: syntax error before '}' token
../gdbstub/gdbstub.c:188: error: syntax error before "u32"
../gdbstub/gdbstub.c:204: warning: parameter names (without types) in function declaration
../gdbstub/gdbstub.c:204: warning: data definition has no type or storage class
../gdbstub/gdbstub.c:205: error: syntax error before '}' token
../gdbstub/gdbstub.c:236: error: syntax error before "u8"
../gdbstub/gdbstub.c: In function `hex2mem':

../gdbstub/gdbstub.c:240: error: `count' undeclared (first use in this function)
../gdbstub/gdbstub.c:241: error: `buf' undeclared (first use in this function)
../gdbstub/gdbstub.c:244: error: `mem' undeclared (first use in this function)
../gdbstub/gdbstub.c: At top level:
../gdbstub/gdbstub.c:256: error: syntax error before '*' token
../gdbstub/gdbstub.c: In function `hexToInt':
../gdbstub/gdbstub.c:261: error: `intValue' undeclared (first use in this function)
../gdbstub/gdbstub.c:263: error: `ptr' undeclared (first use in this function)
../gdbstub/gdbstub.c: At top level:

../gdbstub/gdbstub.c:284: error: syntax error before '*' token

../gdbstub/gdbstub.c:285: error: syntax error before "u32"
../gdbstub/gdbstub.c: In function `mem2hex':
../gdbstub/gdbstub.c:288: error: `u8' undeclared (first use in this function)
../gdbstub/gdbstub.c:288: error: syntax error before "ch"
../gdbstub/gdbstub.c:292: error: `count' undeclared (first use in this function)
../gdbstub/gdbstub.c:294: error: `ch' undeclared (first use in this function)
../gdbstub/gdbstub.c:294: error: `memio' undeclared (first use in this function)
../gdbstub/gdbstub.c:294: error: `mem_addr' undeclared (first use in this function)
../gdbstub/gdbstub.c:295: error: `buf' undeclared (first use in this function)
../gdbstub/gdbstub.c: In function `readPacket_gdb':
../gdbstub/gdbstub.c:308: error: `u8' undeclared (first use in this function)

../gdbstub/gdbstub.c:308: error: syntax error before "cur_byte"
../gdbstub/gdbstub.c:314: error: `cur_byte' undeclared (first use in this function)
../gdbstub/gdbstub.c:315: error: dereferencing pointer to incomplete type
../gdbstub/gdbstub.c:321: error: dereferencing pointer to incomplete type
../gdbstub/gdbstub.c:322: error: dereferencing pointer to incomplete type
../gdbstub/gdbstub.c:323: error: dereferencing pointer to incomplete type
../gdbstub/gdbstub.c:328: error: dereferencing pointer to incomplete type
../gdbstub/gdbstub.c:329: error: dereferencing pointer to incomplete type
../gdbstub/gdbstub.c:330: error: dereferencing pointer to incomplete type
../gdbstub/gdbstub.c:338: error: dereferencing pointer to incomplete type
../gdbstub/gdbstub.c:338: error: dereferencing pointer to incomplete type
../gdbstub/gdbstub.c:339: error: dereferencing pointer to incomplete type
../gdbstub/gdbstub.c:341: error: dereferencing pointer to incomplete type
../gdbstub/gdbstub.c:343: error: dereferencing pointer to incomplete type
../gdbstub/gdbstub.c:347: error: dereferencing pointer to incomplete type
../gdbstub/gdbstub.c:347: error: dereferencing pointer to incomplete type

../gdbstub/gdbstub.c:348: error: dereferencing pointer to incomplete type
../gdbstub/gdbstub.c:348: error: dereferencing pointer to incomplete type
../gdbstub/gdbstub.c:349: error: dereferencing pointer to incomplete type
../gdbstub/gdbstub.c:349: error: dereferencing pointer to incomplete type
../gdbstub/gdbstub.c:354: error: dereferencing pointer to incomplete type
../gdbstub/gdbstub.c:355: error: dereferencing pointer to incomplete type
../gdbstub/gdbstub.c:359: error: dereferencing pointer to incomplete type
../gdbstub/gdbstub.c:360: error: dereferencing pointer to incomplete type
../gdbstub/gdbstub.c: At top level:
../gdbstub/gdbstub.c:402: error: syntax error before "u32"
../gdbstub/gdbstub.c: In function `putpacket':
../gdbstub/gdbstub.c:404: error: `u32' undeclared (first use in this function)
../gdbstub/gdbstub.c:404: error: syntax error before "count"
../gdbstub/gdbstub.c:405: error: `out_packet' undeclared (first use in this function)
../gdbstub/gdbstub.c:406: error: `u8' undeclared (first use in this function)
../gdbstub/gdbstub.c:406: error: syntax error before "reply_ch"
../gdbstub/gdbstub.c:413: error: `count' undeclared (first use in this function)

../gdbstub/gdbstub.c:431: error: `sock' undeclared (first use in this function)
../gdbstub/gdbstub.c:434: error: `reply_ch' undeclared (first use in this function)
../gdbstub/gdbstub.c: At top level:
../gdbstub/gdbstub.c:457: error: syntax error before "make_stop_packet"
../gdbstub/gdbstub.c:457: error: syntax error before '*' token
../gdbstub/gdbstub.c: In function `make_stop_packet':
../gdbstub/gdbstub.c:458: error: `u32' undeclared (first use in this function)
../gdbstub/gdbstub.c:458: error: syntax error before "stop_size"
../gdbstub/gdbstub.c:462: error: `type' undeclared (first use in this function)
../gdbstub/gdbstub.c:465: error: `ptr' undeclared (first use in this function)
../gdbstub/gdbstub.c:468: error: `stop_size' undeclared (first use in this function)
../gdbstub/gdbstub.c: At top level:
../gdbstub/gdbstub.c:518: error: syntax error before '*' token
../gdbstub/gdbstub.c: In function `processPacket_gdb':
../gdbstub/gdbstub.c:522: error: `u8' undeclared (first use in this function)

../gdbstub/gdbstub.c:522: error: `out_ptr' undeclared (first use in this function)
../gdbstub/gdbstub.c:524: error: `u32' undeclared (first use in this function)
../gdbstub/gdbstub.c:524: error: syntax error before "send_size"
../gdbstub/gdbstub.c:528: error: `packet' undeclared (first use in this function)
../gdbstub/gdbstub.c:540: error: `send_size' undeclared (first use in this function)
../gdbstub/gdbstub.c:540: error: `stub' undeclared (first use in this function)

../gdbstub/gdbstub.c:557: error: syntax error before "instr_addr"
../gdbstub/gdbstub.c:564: error: `instr_addr' undeclared (first use in this function)
../gdbstub/gdbstub.c:566: error: `step_instruction_watch' undeclared (first use in this function)
../gdbstub/gdbstub.c:584: error: syntax error before "reg"
../gdbstub/gdbstub.c:586: error: syntax error before '*' token
../gdbstub/gdbstub.c:589: error: `rx_ptr' undeclared (first use in this function)
../gdbstub/gdbstub.c:589: error: `reg' undeclared (first use in this function)
../gdbstub/gdbstub.c:591: error: syntax error before "tmp_mem"
../gdbstub/gdbstub.c:593: error: `tmp_mem' undeclared (first use in this function)

../gdbstub/gdbstub.c:594: error: `value' undeclared (first use in this function)
../gdbstub/gdbstub.c:610: error: syntax error before "addr"
../gdbstub/gdbstub.c:613: error: syntax error before '*' token
../gdbstub/gdbstub.c:615: error: `addr' undeclared (first use in this function)

../gdbstub/gdbstub.c:617: error: `length' undeclared (first use in this function)
../gdbstub/gdbstub.c:638: error: syntax error before '*' token
../gdbstub/gdbstub.c:647: error: syntax error before "write_byte"
../gdbstub/gdbstub.c:653: error: `write_byte' undeclared (first use in this function)
../gdbstub/gdbstub.c:683: error: syntax error before '*' token
../gdbstub/gdbstub.c:701: error: syntax error before "addr"
../gdbstub/gdbstub.c:739: error: dereferencing pointer to incomplete type
../gdbstub/gdbstub.c:744: error: dereferencing pointer to incomplete type

../gdbstub/gdbstub.c:747: error: dereferencing pointer to incomplete type
../gdbstub/gdbstub.c:747: error: dereferencing pointer to incomplete type
../gdbstub/gdbstub.c:749: error: dereferencing pointer to incomplete type
../gdbstub/gdbstub.c:753: error: dereferencing pointer to incomplete type
../gdbstub/gdbstub.c:768: error: dereferencing pointer to incomplete type
../gdbstub/gdbstub.c:770: error: dereferencing pointer to incomplete type
../gdbstub/gdbstub.c:771: error: dereferencing pointer to incomplete type
../gdbstub/gdbstub.c:773: error: dereferencing pointer to incomplete type
../gdbstub/gdbstub.c:805: error: syntax error before '*' token
../gdbstub/gdbstub.c:815: error: `reg_values' undeclared (first use in this function)
../gdbstub/gdbstub.c:825: error: `cpsr' undeclared (first use in this function)

../gdbstub/gdbstub.c:837: error: syntax error before "pc_value"
../gdbstub/gdbstub.c:844: error: syntax error before "reg"
../gdbstub/gdbstub.c:855: error: `pc_value' undeclared (first use in this function)
../gdbstub/gdbstub.c:882: error: `cpsr_value' undeclared (first use in this function)
../gdbstub/gdbstub.c:897: error: `sock' undeclared (first use in this function)
../gdbstub/gdbstub.c: At top level:
../gdbstub/gdbstub.c:970: error: syntax error before "static"
../gdbstub/gdbstub.c:973: error: syntax error before "u32"
../gdbstub/gdbstub.c:991: warning: parameter names (without types) in function declaration
../gdbstub/gdbstub.c:991: warning: data definition has no type or storage class
../gdbstub/gdbstub.c:992: error: syntax error before '}' token
../gdbstub/gdbstub.c:993: error: invalid type argument of `->'
../gdbstub/gdbstub.c:993: warning: data definition has no type or storage class
../gdbstub/gdbstub.c:994: error: syntax error before '}' token
../gdbstub/gdbstub.c:1001: error: syntax error before "u32"
../gdbstub/gdbstub.c: In function `execute_gdb':
../gdbstub/gdbstub.c:1002: error: `data' undeclared (first use in this function)
../gdbstub/gdbstub.c:1005: error: dereferencing pointer to incomplete type
../gdbstub/gdbstub.c:1006: error: dereferencing pointer to incomplete type
../gdbstub/gdbstub.c:1010: error: dereferencing pointer to incomplete type
../gdbstub/gdbstub.c:1011: error: dereferencing pointer to incomplete type
../gdbstub/gdbstub.c:1016: error: dereferencing pointer to incomplete type
../gdbstub/gdbstub.c:1017: error: dereferencing pointer to incomplete type
../gdbstub/gdbstub.c:1018: error: dereferencing pointer to incomplete type
../gdbstub/gdbstub.c:1019: error: dereferencing pointer to incomplete type
../gdbstub/gdbstub.c:1022: error: dereferencing pointer to incomplete type
../gdbstub/gdbstub.c:1022: error: `instr_addr' undeclared (first use in this function)
../gdbstub/gdbstub.c:1024: error: dereferencing pointer to incomplete type
../gdbstub/gdbstub.c:1025: error: dereferencing pointer to incomplete type
../gdbstub/gdbstub.c:1028: error: dereferencing pointer to incomplete type
../gdbstub/gdbstub.c:1033: error: dereferencing pointer to incomplete type
../gdbstub/gdbstub.c:1034: error: dereferencing pointer to incomplete type
../gdbstub/gdbstub.c: In function `listenerThread_gdb':
../gdbstub/gdbstub.c:1052: error: dereferencing pointer to incomplete type
../gdbstub/gdbstub.c:1052: error: dereferencing pointer to incomplete type
../gdbstub/gdbstub.c:1053: error: dereferencing pointer to incomplete type
../gdbstub/gdbstub.c:1053: error: dereferencing pointer to incomplete type
../gdbstub/gdbstub.c:1068: error: dereferencing pointer to incomplete type
../gdbstub/gdbstub.c:1069: error: `u8' undeclared (first use in this function)
../gdbstub/gdbstub.c:1069: error: syntax error before "ctl_command"
../gdbstub/gdbstub.c:1073: error: dereferencing pointer to incomplete type
../gdbstub/gdbstub.c:1073: error: `ctl_command' undeclared (first use in this function)
../gdbstub/gdbstub.c:1081: error: dereferencing pointer to incomplete type
../gdbstub/gdbstub.c:1082: error: dereferencing pointer to incomplete type

../gdbstub/gdbstub.c:1084: error: `ptr' undeclared (first use in this function)
../gdbstub/gdbstub.c:1085: error: `u32' undeclared (first use in this function)
../gdbstub/gdbstub.c:1085: error: syntax error before "send_size"
../gdbstub/gdbstub.c:1088: error: dereferencing pointer to incomplete type
../gdbstub/gdbstub.c:1089: error: dereferencing pointer to incomplete type
../gdbstub/gdbstub.c:1091: error: `send_size' undeclared (first use in this function)
../gdbstub/gdbstub.c:1091: error: dereferencing pointer to incomplete type

../gdbstub/gdbstub.c:1091: error: dereferencing pointer to incomplete type
../gdbstub/gdbstub.c:1097: error: dereferencing pointer to incomplete type
../gdbstub/gdbstub.c:1114: error: dereferencing pointer to incomplete type
../gdbstub/gdbstub.c:1136: error: dereferencing pointer to incomplete type

../gdbstub/gdbstub.c:1136: error: dereferencing pointer to incomplete type
../gdbstub/gdbstub.c:1161: error: dereferencing pointer to incomplete type
../gdbstub/gdbstub.c:1176: error: dereferencing pointer to incomplete type
../gdbstub/gdbstub.c:1176: error: dereferencing pointer to incomplete type

../gdbstub/gdbstub.c:1177: error: dereferencing pointer to incomplete type
../gdbstub/gdbstub.c:1179: error: dereferencing pointer to incomplete type
../gdbstub/gdbstub.c:1195: error: dereferencing pointer to incomplete type
../gdbstub/gdbstub.c:1201: error: dereferencing pointer to incomplete type

../gdbstub/gdbstub.c:1206: error: dereferencing pointer to incomplete type
../gdbstub/gdbstub.c:1206: error: dereferencing pointer to incomplete type
../gdbstub/gdbstub.c:1207: error: `break_execution' undeclared (first use in this function)
../gdbstub/gdbstub.c:1214: error: syntax error before "reply"
../gdbstub/gdbstub.c:1218: error: dereferencing pointer to incomplete type

../gdbstub/gdbstub.c:1220: error: dereferencing pointer to incomplete type
../gdbstub/gdbstub.c:1222: error: `reply' undeclared (first use in this function)
../gdbstub/gdbstub.c:1226: error: dereferencing pointer to incomplete type
../gdbstub/gdbstub.c:1226: error: dereferencing pointer to incomplete type
../gdbstub/gdbstub.c:1241: error: dereferencing pointer to incomplete type
../gdbstub/gdbstub.c:1253: error: dereferencing pointer to incomplete type
../gdbstub/gdbstub.c:1267: error: dereferencing pointer to incomplete type
../gdbstub/gdbstub.c:1269: error: dereferencing pointer to incomplete type
../gdbstub/gdbstub.c:1277: error: dereferencing pointer to incomplete type
../gdbstub/gdbstub.c: At top level:
../gdbstub/gdbstub.c:1294: warning: `__fastcall__' attribute only applies to function types
../gdbstub/gdbstub.c:1294: error: syntax error before "gdb_prefetch32"
../gdbstub/gdbstub.c:1296: warning: data definition has no type or storage class
../gdbstub/gdbstub.c:1299: error: `stub' undeclared here (not in a function)
../gdbstub/gdbstub.c:1299: error: `adr' undeclared here (not in a function)
../gdbstub/gdbstub.c:1300: error: initializer element is not constant
../gdbstub/gdbstub.c:1300: warning: data definition has no type or storage class
../gdbstub/gdbstub.c:1302: error: syntax error before "if"
../gdbstub/gdbstub.c:1311: warning: `__fastcall__' attribute only applies to function types
../gdbstub/gdbstub.c:1311: error: syntax error before "gdb_prefetch16"
../gdbstub/gdbstub.c:1313: error: redefinition of 'value'
../gdbstub/gdbstub.c:1296: error: previous definition of 'value' was here
../gdbstub/gdbstub.c:1313: warning: data definition has no type or storage class
../gdbstub/gdbstub.c:1316: error: redefinition of 'breakpoint'
../gdbstub/gdbstub.c:1299: error: previous definition of 'breakpoint' was here
../gdbstub/gdbstub.c:1317: error: initializer element is not constant
../gdbstub/gdbstub.c:1317: warning: data definition has no type or storage class
../gdbstub/gdbstub.c:1319: error: syntax error before "if"
../gdbstub/gdbstub.c:1330: warning: `__fastcall__' attribute only applies to function types
../gdbstub/gdbstub.c:1330: error: syntax error before "gdb_read8"
../gdbstub/gdbstub.c:1332: error: redefinition of 'value'
../gdbstub/gdbstub.c:1313: error: previous definition of 'value' was here
../gdbstub/gdbstub.c:1332: error: redefinition of 'value'
../gdbstub/gdbstub.c:1313: error: previous definition of 'value' was here
../gdbstub/gdbstub.c:1332: warning: data definition has no type or storage class
../gdbstub/gdbstub.c:1336: error: redefinition of 'value'
../gdbstub/gdbstub.c:1332: error: previous definition of 'value' was here
../gdbstub/gdbstub.c:1336: error: redefinition of 'value'

../gdbstub/gdbstub.c:1313: error: previous definition of 'value' was here
../gdbstub/gdbstub.c:1337: warning: data definition has no type or storage class
../gdbstub/gdbstub.c:1339: error: redefinition of 'breakpoint'
../gdbstub/gdbstub.c:1316: error: previous definition of 'breakpoint' was here
../gdbstub/gdbstub.c:1339: error: redefinition of 'breakpoint'
../gdbstub/gdbstub.c:1316: error: previous definition of 'breakpoint' was here
../gdbstub/gdbstub.c:1340: error: initializer element is not constant
../gdbstub/gdbstub.c:1340: warning: data definition has no type or storage class
../gdbstub/gdbstub.c:1341: error: syntax error before "if"
../gdbstub/gdbstub.c:1350: warning: `__fastcall__' attribute only applies to function types
../gdbstub/gdbstub.c:1350: error: syntax error before "gdb_read16"
../gdbstub/gdbstub.c:1352: warning: data definition has no type or storage class
../gdbstub/gdbstub.c:1356: error: redefinition of 'value'

../gdbstub/gdbstub.c:1336: error: previous definition of 'value' was here
../gdbstub/gdbstub.c:1356: error: redefinition of 'value'
../gdbstub/gdbstub.c:1313: error: previous definition of 'value' was here
../gdbstub/gdbstub.c:1357: warning: data definition has no type or storage class
../gdbstub/gdbstub.c:1359: error: redefinition of 'breakpoint'
../gdbstub/gdbstub.c:1339: error: previous definition of 'breakpoint' was here
../gdbstub/gdbstub.c:1359: error: redefinition of 'breakpoint'
../gdbstub/gdbstub.c:1316: error: previous definition of 'breakpoint' was here
../gdbstub/gdbstub.c:1360: error: initializer element is not constant
../gdbstub/gdbstub.c:1360: warning: data definition has no type or storage class
../gdbstub/gdbstub.c:1361: error: syntax error before "if"
../gdbstub/gdbstub.c:1369: warning: `__fastcall__' attribute only applies to function types
../gdbstub/gdbstub.c:1369: error: syntax error before "gdb_read32"
../gdbstub/gdbstub.c:1371: warning: data definition has no type or storage class
../gdbstub/gdbstub.c:1375: error: redefinition of 'value'
../gdbstub/gdbstub.c:1356: error: previous definition of 'value' was here
../gdbstub/gdbstub.c:1375: error: redefinition of 'value'
../gdbstub/gdbstub.c:1313: error: previous definition of 'value' was here
../gdbstub/gdbstub.c:1376: warning: data definition has no type or storage class
../gdbstub/gdbstub.c:1378: error: redefinition of 'breakpoint'
../gdbstub/gdbstub.c:1359: error: previous definition of 'breakpoint' was here
../gdbstub/gdbstub.c:1378: error: redefinition of 'breakpoint'
../gdbstub/gdbstub.c:1316: error: previous definition of 'breakpoint' was here
../gdbstub/gdbstub.c:1379: error: initializer element is not constant

../gdbstub/gdbstub.c:1379: warning: data definition has no type or storage class
../gdbstub/gdbstub.c:1380: error: syntax error before "if"
../gdbstub/gdbstub.c:1389: error: syntax error before "u32"
../gdbstub/gdbstub.c: In function `gdb_write8':
../gdbstub/gdbstub.c:1390: error: `data' undeclared (first use in this function)
../gdbstub/gdbstub.c:1394: error: dereferencing pointer to incomplete type
../gdbstub/gdbstub.c:1394: error: dereferencing pointer to incomplete type
../gdbstub/gdbstub.c:1395: error: `val' undeclared (first use in this function)
../gdbstub/gdbstub.c:1397: error: dereferencing pointer to incomplete type
../gdbstub/gdbstub.c:1400: error: dereferencing pointer to incomplete type
../gdbstub/gdbstub.c: At top level:
../gdbstub/gdbstub.c:1406: error: syntax error before "u32"
../gdbstub/gdbstub.c: In function `gdb_write16':
../gdbstub/gdbstub.c:1407: error: `data' undeclared (first use in this function)
../gdbstub/gdbstub.c:1411: error: dereferencing pointer to incomplete type
../gdbstub/gdbstub.c:1411: error: dereferencing pointer to incomplete type
../gdbstub/gdbstub.c:1412: error: `val' undeclared (first use in this function)
../gdbstub/gdbstub.c:1414: error: dereferencing pointer to incomplete type
../gdbstub/gdbstub.c:1417: error: dereferencing pointer to incomplete type
../gdbstub/gdbstub.c: At top level:
../gdbstub/gdbstub.c:1423: error: syntax error before "u32"
../gdbstub/gdbstub.c: In function `gdb_write32':
../gdbstub/gdbstub.c:1424: error: `data' undeclared (first use in this function)
../gdbstub/gdbstub.c:1428: error: dereferencing pointer to incomplete type
../gdbstub/gdbstub.c:1428: error: dereferencing pointer to incomplete type
../gdbstub/gdbstub.c:1429: error: `val' undeclared (first use in this function)
../gdbstub/gdbstub.c:1431: error: dereferencing pointer to incomplete type
../gdbstub/gdbstub.c:1434: error: dereferencing pointer to incomplete type
../gdbstub/gdbstub.c: At top level:
../gdbstub/gdbstub.c:1483: error: syntax error before "createStub_gdb"
../gdbstub/gdbstub.c:1483: error: syntax error before "port"
../gdbstub/gdbstub.c: In function `createStub_gdb':
../gdbstub/gdbstub.c:1486: error: invalid application of `sizeof' to incomplete type `gdb_stub_state'
../gdbstub/gdbstub.c:1487: error: `gdbstub_handle_t' undeclared (first use in this function)
../gdbstub/gdbstub.c:1487: error: syntax error before "handle"
../gdbstub/gdbstub.c:1492: warning: return makes integer from pointer without a cast
../gdbstub/gdbstub.c:1495: error: dereferencing pointer to incomplete type
../gdbstub/gdbstub.c:1498: error: dereferencing pointer to incomplete type
../gdbstub/gdbstub.c:1498: error: `cpu_memio' undeclared (first use in this function)
../gdbstub/gdbstub.c:1499: error: dereferencing pointer to incomplete type
../gdbstub/gdbstub.c:1499: error: `direct_memio' undeclared (first use in this function)
../gdbstub/gdbstub.c:1501: error: dereferencing pointer to incomplete type
../gdbstub/gdbstub.c:1504: error: dereferencing pointer to incomplete type
../gdbstub/gdbstub.c:1505: error: dereferencing pointer to incomplete type
../gdbstub/gdbstub.c:1505: error: `gdb_prefetch32' undeclared (first use in this function)
../gdbstub/gdbstub.c:1506: error: dereferencing pointer to incomplete type
../gdbstub/gdbstub.c:1506: error: `gdb_prefetch16' undeclared (first use in this function)
../gdbstub/gdbstub.c:1508: error: dereferencing pointer to incomplete type
../gdbstub/gdbstub.c:1508: error: `gdb_read8' undeclared (first use in this function)
../gdbstub/gdbstub.c:1509: error: dereferencing pointer to incomplete type
../gdbstub/gdbstub.c:1509: error: `gdb_read16' undeclared (first use in this function)
../gdbstub/gdbstub.c:1510: error: dereferencing pointer to incomplete type
../gdbstub/gdbstub.c:1510: error: `gdb_read32' undeclared (first use in this function)
../gdbstub/gdbstub.c:1512: error: dereferencing pointer to incomplete type
../gdbstub/gdbstub.c:1513: error: dereferencing pointer to incomplete type
../gdbstub/gdbstub.c:1514: error: dereferencing pointer to incomplete type
../gdbstub/gdbstub.c:1520: error: dereferencing pointer to incomplete type
../gdbstub/gdbstub.c:1520: error: dereferencing pointer to incomplete type
../gdbstub/gdbstub.c:1522: error: dereferencing pointer to incomplete type
../gdbstub/gdbstub.c:1523: error: dereferencing pointer to incomplete type
../gdbstub/gdbstub.c:1523: error: dereferencing pointer to incomplete type
../gdbstub/gdbstub.c:1524: error: dereferencing pointer to incomplete type
../gdbstub/gdbstub.c:1526: error: dereferencing pointer to incomplete type
../gdbstub/gdbstub.c:1527: error: dereferencing pointer to incomplete type
../gdbstub/gdbstub.c:1528: error: dereferencing pointer to incomplete type
../gdbstub/gdbstub.c:1541: warning: return makes integer from pointer without a cast
../gdbstub/gdbstub.c:1547: error: dereferencing pointer to incomplete type
../gdbstub/gdbstub.c:1563: error: dereferencing pointer to incomplete type
../gdbstub/gdbstub.c:1565: error: dereferencing pointer to incomplete type
../gdbstub/gdbstub.c:1570: error: dereferencing pointer to incomplete type
../gdbstub/gdbstub.c:1593: error: dereferencing pointer to incomplete type
../gdbstub/gdbstub.c:1594: error: dereferencing pointer to incomplete type
../gdbstub/gdbstub.c:1595: error: dereferencing pointer to incomplete type
../gdbstub/gdbstub.c:1596: error: dereferencing pointer to incomplete type
../gdbstub/gdbstub.c:1598: error: dereferencing pointer to incomplete type
../gdbstub/gdbstub.c:1600: error: dereferencing pointer to incomplete type
../gdbstub/gdbstub.c:1600: error: `port' undeclared (first use in this function)
../gdbstub/gdbstub.c:1601: error: dereferencing pointer to incomplete type
../gdbstub/gdbstub.c:1602: error: dereferencing pointer to incomplete type
../gdbstub/gdbstub.c:1604: error: dereferencing pointer to incomplete type
../gdbstub/gdbstub.c:1606: error: dereferencing pointer to incomplete type
../gdbstub/gdbstub.c:1614: error: dereferencing pointer to incomplete type
../gdbstub/gdbstub.c:1616: error: dereferencing pointer to incomplete type
../gdbstub/gdbstub.c:1621: error: `handle' undeclared (first use in this function)
../gdbstub/gdbstub.c: At top level:
../gdbstub/gdbstub.c:1635: error: syntax error before "instance"
../gdbstub/gdbstub.c: In function `destroyStub_gdb':
../gdbstub/gdbstub.c:1636: error: `instance' undeclared (first use in this function)

../gdbstub/gdbstub.c:1641: error: dereferencing pointer to incomplete type
../gdbstub/gdbstub.c: At top level:
../gdbstub/gdbstub.c:1650: error: syntax error before "instance"
../gdbstub/gdbstub.c: In function `activateStub_gdb':
../gdbstub/gdbstub.c:1652: error: `instance' undeclared (first use in this function)

../gdbstub/gdbstub.c:1654: error: dereferencing pointer to incomplete type
../gdbstub/gdbstub.c:1654: error: `cpu_ctrl' undeclared (first use in this function)
../gdbstub/gdbstub.c:1657: error: dereferencing pointer to incomplete type
../gdbstub/gdbstub.c:1657: error: dereferencing pointer to incomplete type
../gdbstub/gdbstub.c:1659: error: dereferencing pointer to incomplete type
../gdbstub/gdbstub.c: At top level:
../gdbstub/gdbstub_internal.h:124: error: storage size of `rx_packet' isn't known
../gdbstub/gdbstub_internal.h:140: error: storage size of `step_breakpoint_descr' isn't known
../gdbstub/gdbstub_internal.h:143: error: storage size of `breakpoint_pool' isn't known
gcc.exe: HAVE_LIBZZIP: No such file or directory
gcc.exe: HAVE_LIBZ: No such file or directory
make.exe: *** [obj/gdbstub.o] Error 1

Execution terminated

#6 Support » Building DemuME problem » 2007-06-07 11:07:35

01torres
Replies: 7

I have just update my source code on my computer and when I tried to compile it these error came up does anyonre know how to fix this please.

obj/disView.o(.text+0x2325):disView.c: undefined reference to `armcpu_irqExeption'
obj/disView.o(.text+0x2348):disView.c: undefined reference to `armcpu_irqExeption'
obj/main.o(.text+0x1313):main.c: undefined reference to `createStub_gdb'
obj/main.o(.text+0x19ed):main.c: undefined reference to `createStub_gdb'
obj/main.o(.text+0x1a46):main.c: undefined reference to `activateStub_gdb'
obj/main.o(.text+0x1a63):main.c: undefined reference to `activateStub_gdb'
collect2: ld returned 1 exit status
make.exe: *** [DeSmuME.exe] Error 1
Execution terminated

Ps This was build on Dev-C++

#7 Re: General » irqInit bug in desmume? » 2007-05-28 20:31:47

It might help if you gives us some links to these "apps" so we can have a look at them and see if it has a problem with desmume and if we need to do anything about it.

#8 Re: Support II (decommissioned) » Advance Wars DS » 2007-05-21 15:56:43

Ok tell us a bit later if the "cow problem" happens on your WIP.  This may give you a different angle on the trasparency problem and may actually help you fix transparency 100% (Fingers Crossed). You never know!

#9 Re: Support II (decommissioned) » Advance Wars DS » 2007-05-21 15:33:04

Shash are you asleep you have already fixed transparency problems on your WIP remember the castlevaina pics on your blog. The only think you have to do is add it into the main CVS, like you did for the speed boost 47 hours ago.

Ps Whats the point of thoduv adding video capture when he know it does not work. (It says so in his logo entry for GPU.c)

#10 Re: Support » Weird Sound Bug » 2007-05-16 16:38:21

That does not solve the problem and do not think is related to the question at all.

Ps I think there should just be a tick box in the config menu to mute the sound. This will same me a bit of time for example when I am watching a video and do not want to hear the DeSmuME at the same time. I have to into the config menu then the sound menu as well

#11 Support » Weird Sound Bug » 2007-05-16 15:29:05

01torres
Replies: 2

When I change the sound settings and  click ok (from none to direct sound interface and vice versa) the deSmuME starts running a imaginary game (this is before opening any games). I am just wondering why this happens. This bug is happening on DeSmuME Version 7.0.0 Windows Build.

#12 Re: Support II (decommissioned) » Subject3 dadadadad! est!!!! » 2007-05-13 19:09:48

My god this is the third spam thread we have had in the last 24 hours. Delete this guy now.

#13 Re: Support II (decommissioned) » um i was playing megaman zx but no sound with desmume 6.0 » 2007-05-13 19:06:53

No it cannot play pokemon diamond or pearl if you bothered to read any of the old threads than you would know that they do not work and that we do not like pokemon fans in these forums beccause they are always asking when there game is going to work

#14 General » Forum room button in DeSmuME » 2007-05-12 18:47:32

01torres
Replies: 1

I would suggest that this button should link to these forum rooms not the SourceForge ones.
It would only take one line change in main.c for the windows version do not know about the other version.
I could properly do it myself if you have not got time.

Also I propose that we remove the frameskip options until they work and have it permantly set on 0.
I do not know how do this so somebody else would have implent this if it agreed upon that this fixes are worth it.

#15 Re: Support II (decommissioned) » Resident Evil Deadly Silence » 2007-05-12 12:31:20

i am sorry to disapoint you but Resident Evil does not work with the lastest desmume you will just have to wait a bit long to play on this game.

#16 Re: General » is v0.7 really better » 2007-05-12 09:21:48

FF3 does not work with the latest desmume when you click new game near the begining it freezes and all you can hear is music in the background.

sqqq: be patient when shash implents all of his fixes e.g transparency
Then games like advance Wars will work properly and to boot will get a speed boost as well. Take a look two links below to see what I mean and I far as I know these bit have not been implented yet.

http://forums.desmume.org/viewtopic.php?id=11
http://forums.desmume.org/viewtopic.php?id=5

The last one talks about fixes which will make advance Wars a lot better.

#17 Re: Support » so slow, is it normal? » 2007-05-12 09:18:55

Right first try this open desmume go into the Config menu then the fameskip menu change auto to 0 if this  does not help then give me alist of game you have tried and will find out if it's just your copy

Ps Most games are slow try digimon world this runs a good speed.

#18 Support » opengl_collector_3Demu .h/.c » 2007-05-09 15:39:26

01torres
Replies: 1

I noticed that these files are not being complied when I make DeSmuME and I have a couple of question's about these two files.

1. What do these files do and do I need to add them to the project
2. Do I need  to manually enter  them into the project or are the project files going to be updated
3. If I do manually enter the files do I need to add anything to the project options or to add any extra files.

#19 Re: Support II (decommissioned) » What's working on PPC? » 2007-05-08 19:12:04

No I am saying that it works on windows as have not got a mac. I was just suggesting a course of action. As I have not got a Mac i do not know if this is normal or not. Does anyone own an Mac and can he tells us if DesmuMe works on it?

Ps lokicat: sorry if I deceived into thinking that I had a mac that was not my intention.

#20 Re: Support II (decommissioned) » What's working on PPC? » 2007-05-08 17:56:40

Do the mean the games if so give us a list of games and we will tell you if they work at the moment in the mean time try Digimon World because I am certain this game works. If this game does not work the Desmume that you complied/downloaded is corrupt.

#21 Re: General » Rom not woking, please help me! » 2007-05-06 18:07:15

This gets better and better first you are pokemon fanboy and now you are telling us that the emu you are using has nothing to do with these us. Look at title of forum room DeSmuME not NDesmuMe that is total different emu If you want to try our emu the link is below.

http://amponzi.googlepages.com/

Ps The Website for your emu is http://www.desmume.com/
    The Website for our emu is http://www.desmume.org
     Note The difference

#22 Re: General » Rom not woking, please help me! » 2007-05-06 16:57:54

Pokemon Fans are all the same.
Could you at least tells us which pokemon game it is and what the game does when when you run the rom. Also which version of emu are you using.

Ps As solidsnake said most pokemon games does not work

#23 Re: Support II (decommissioned) » pokemon ranger » 2007-05-05 16:59:31

It will help if you tells us which port you are using and  which OS as well. The game is a bit slow but nothing to complain about.
I do not what is wrong which the characters but the game is perfectly playable without the seeing the character just a bit harder that all.
And do not ask when this going to be fixed you should be grateful that game works at all. If you cannot wait for the game to work properly then buy the game and play on a real ds.

#24 Re: Support II (decommissioned) » Megaman Zx » 2007-05-05 11:39:08

Shash: Strangely saves now work for me on this game I do not know what happened before

snkmad: Thanks for the help save states now work for me

#25 Re: Support II (decommissioned) » Megaman Zx » 2007-05-04 19:11:00

snkmad: I have already got Zlib and it does not seem to be working for me (I have Zlib in the same folder next to Emu). Could you give me a link to see if it's just my copy that's bad.

Heiftig: I only get 20fps same as snkmad so you computer must very good to get them speeds.

Board footer

Powered by FluxBB